Recommand · October 14, 2021 0

If I use Asserts in my program (org.junit.Assert) that test run fine in my local but getting failure in Jenkins run

<‘can someone pls help solve this issue’

Feature File
Feature: Crosswalk Event Creation from SP
This feature verifies all combinations of Crosswalk event creation functionality

Scenario: 01 Create a Event–Powerunit–Single–Brakes
Given Create an Event using AdvanceSearch– SCcrosswalk — crosswalk1
| EquipmentType | EquipmentProviderType | EquipmentProvider |
| Power Unit | crosswalk search | crosswalk1 |
When Enter Service details
| EquipmentType | System | Assembly | Component | Position | WorkAccomplished | Reason |
| Power Unit | Brakes | Electric Brakes | Electric Brakes (EBS) | Front Center | Adjust | Abuse Caused by Driver |
And Get Event information from — SCCROSSWALK
And Verify Event Status
| StatusType | TenandType | Status | Page |
| Single | SCcrosswalk | Submitted | Dashboard |
| Single | SCcrosswalk | Submitted | EventInfo |

Scenario: 02 Create a Event–Powerunit–Single–Brakes
Given Create an Event using AdvanceSearch– SCcrosswalk — crosswalk2
| EquipmentType | EquipmentProviderType | EquipmentProvider |
| Power Unit | crosswalk search | crosswalk2 |
When Enter Service details
| EquipmentType | System | Assembly | Component | Position | WorkAccomplished | Reason |
| Power Unit | Brakes | Electric Brakes | Electric Brakes (EBS) | Front Center | Adjust | Abuse Caused by Driver |
And Get Event information from — SCCROSSWALK
And Verify Event Status
| StatusType | TenandType | Status | Page |
| Single | SCcrosswalk | Submitted | Dashboard |
| Single | SCcrosswalk | Submitted | EventInfo |

Scenario: 03 Create a Event–Powerunit–Single–Brakes
Given Create an Event using AdvanceSearch– SCcrosswalk — crosswalk3
| EquipmentType | EquipmentProviderType | EquipmentProvider |
| Power Unit | crosswalk search | crosswalk3 |
When Enter Service details
| EquipmentType | System | Assembly | Component | Position | WorkAccomplished | Reason |
| Power Unit | Brakes | Electric Brakes | Electric Brakes (EBS) | Front Center | Adjust | Abuse Caused by Driver |
#And Get Event information from — SCCROSSWALK
Then Validate Customer notes from Additional details tab

Scenario: 04 Create a Event–Powerunit–Single–Brakes
Given Create an Event using AdvanceSearch– SCcrosswalk — crosswalk4
| EquipmentType | EquipmentProviderType | EquipmentProvider |
| Power Unit | crosswalk search | crosswalk4 |
When Enter Service details
| EquipmentType | System | Assembly | Component | Position | WorkAccomplished | Reason |
| Power Unit | Brakes | Electric Brakes | Electric Brakes (EBS) | Front Center | Adjust | Abuse Caused by Driver |
And Get Event information from — SCCROSSWALK
And Verify Event Status
| StatusType | TenandType | Status | Page |
| Single | SCcrosswalk | Submitted | Dashboard |
| Single | SCcrosswalk | Submitted | EventInfo |

Scenario: 05 Create a Event–Powerunit–Single–Brakes
Given Create an Event using AdvanceSearch– SCcrosswalk — crosswalk5
| EquipmentType | EquipmentProviderType | EquipmentProvider |
| Power Unit | crosswalk search | crosswalk5 |
When Enter Service details
| EquipmentType | System | Assembly | Component | Position | WorkAccomplished | Reason |
| Power Unit | Brakes | Electric Brakes | Electric Brakes (EBS) | Front Center | Adjust | Abuse Caused by Driver |
And Get Event information from — SCCROSSWALK

Locater class:

enter code here

package org.reach24.Reach24Admin.pages;

import org.junit.Assert;
import org.openqa.selenium.JavascriptExecutor;
import org.openqa.selenium.WebDriver;
import org.openqa.selenium.WebElement;
import org.openqa.selenium.support.FindBy;
import org.openqa.selenium.support.PageFactory;
import org.reach24.Reach24Admin.util.PropsReader;
import org.reach24.Reach24Admin.util.Wait;

public class CrosswalkPage {
    
        WebDriver driver;
        PropsReader propsReader = new PropsReader();
        Wait wait;
        
        public CrosswalkPage(WebDriver driver) {
            this.driver = driver;
            PageFactory.initElements(driver, this);
            wait = new Wait(driver);
        }
        
        public void scrolldownandclick(WebElement elementLocator) {
            JavascriptExecutor js = (JavascriptExecutor) driver;
            js.executeScript("arguments[0].scrollIntoView(true);", elementLocator);
            js.executeScript("arguments[0].click();", elementLocator);
        }
        
        public void jsclick(WebElement elementLocator) {
            JavascriptExecutor js = (JavascriptExecutor) driver;
            js.executeScript("arguments[0].click();", elementLocator);
        }
        
        public void hardwait2() {
            try {
                Thread.sleep(2000);
            } catch (InterruptedException e) {
                e.printStackTrace();
            }
        }
        
        
        @FindBy(id = "form-header")
        private WebElement EPwalkininfo ;
        @FindBy(id = "select-ep-td")
        private WebElement EPTDsame ;
        @FindBy(id = "select_ep_td_Yes")
        private WebElement EPTDsameyes;
        @FindBy(id = "select_ep_td_No")
        private WebElement EPTDsameNo;
        @FindBy(name = "incident[walkin_iep_attributes][name]")
        private WebElement EPTDname;
        @FindBy(name = "incident[walkin_iep_attributes][address]")
        private WebElement EPTDaddress;
        @FindBy(name = "incident[walkin_iep_attributes][phone]")
        private WebElement EPTDphone;
        @FindBy(xpath = "//select[@id='void_reason']")
        private WebElement selectdrop;
        @FindBy(id = "s2id_incident_responsible_payer_id")
        private WebElement Responsiblepayer;
        
        public void Crosswalk1() {
            if (EPwalkininfo.isDisplayed()) {
                Assert.assertTrue(EPTDsame.isDisplayed());
                if (EPTDsameyes.isEnabled() || EPTDsameNo.isEnabled()) {
                    EPTDsameyes.isSelected();
                }else {
                    EPTDsameNo.isSelected();
                }
            }
            String name = EPTDname.getText();
            System.out.println("crosswalk value: "+ name);
            Assert.assertTrue(name !=null);
            String address = EPTDaddress.getText();
            Assert.assertTrue(address != null);
            String phone = EPTDphone.getText();
            Assert.assertTrue(phone != null);
            System.out.println("Crosswalk Verified");
            String responspayer = Responsiblepayer.getText();
            System.out.println(responspayer);
            Assert.assertEquals("Autocrosswalk", responspayer);
        }
        
        @FindBy(id = "s2id_payment_method")
        private WebElement paymentmethod;
        
        public void Crosswalk2() {
            if (EPwalkininfo.isDisplayed()) {
                Assert.assertTrue(EPTDsame.isDisplayed());
                if (EPTDsameyes.isEnabled() || EPTDsameNo.isEnabled()) {
                    EPTDsameyes.isSelected();
                }else {
                    EPTDsameNo.isSelected();
                }
            }
            String name = EPTDname.getText();
            System.out.println("crosswalk value: "+ name);
            Assert.assertTrue(name !=null);
            String address = EPTDaddress.getText();
            Assert.assertTrue(address != null);
            String phone = EPTDphone.getText();
            Assert.assertTrue(phone != null);
            System.out.println("Crosswalk Verified");
            String responspayer = Responsiblepayer.getText();
            System.out.println(responspayer);
            Assert.assertEquals("Walk-In Fleet", responspayer);
            String payment = paymentmethod.getText();
            System.out.println(payment);
            Assert.assertEquals("Bridgestone", payment);
        }
        
        @FindBy(id = "select2-chosen-16")
        private WebElement Equipprovider;
        
        public void Crosswalk3() {
            wait.forElementToBeDisplayed(Equipprovider);
            String euppro = Equipprovider.getText();
            System.out.println(euppro);
            Assert.assertEquals("AutoTruck TD", euppro);
            String responspayer = Responsiblepayer.getText();
            System.out.println(responspayer);
            Assert.assertEquals("AutoTruck TD", responspayer);
            String payment = paymentmethod.getText();
            System.out.println(payment);
            Assert.assertEquals("Bridgestone", payment);
        }
        
        public void Crosswalk4() {
            if (EPwalkininfo.isDisplayed()) {
                Assert.assertTrue(EPTDsame.isDisplayed());
                if (EPTDsameyes.isEnabled() || EPTDsameNo.isEnabled()) {
                    EPTDsameyes.isSelected();
                }else {
                    EPTDsameNo.isSelected();
                }
            }
            String name = EPTDname.getText();
            System.out.println("crosswalk value: "+ name);
            Assert.assertTrue(name !=null);
            String address = EPTDaddress.getText();
            Assert.assertTrue(address != null);
            String phone = EPTDphone.getText();
            Assert.assertTrue(phone != null);
            System.out.println("Crosswalk Verified");
            String responspayer = Responsiblepayer.getText();
            System.out.println(responspayer);
            Assert.assertEquals("Walk-In Fleet", responspayer);
            String payment = paymentmethod.getText();
            System.out.println(payment);
            Assert.assertEquals("Continental", payment);
        }
        
        public void Crosswalk5() {
            wait.forElementToBeDisplayed(Equipprovider);
            String euppro = Equipprovider.getText();
            System.out.println(euppro);
            Assert.assertEquals("Autotruck TD1", euppro);
            String responspayer = Responsiblepayer.getText();
            System.out.println(responspayer);
            Assert.assertEquals("Autocrosswalk", responspayer);
        }
        
        @FindBy(xpath = "//div[contains(text( ),'Additional Details')]")
        private WebElement Additionaldetails;
        @FindBy(xpath = "//label[contains(text( ),'Customer Notes')]")
        private WebElement Customernotes;
        @FindBy(xpath = "//p[contains(text( ),'Bridgestone account')]")
        private WebElement notedescription;
        
        public void Verifycustomernotes() {
            wait.forElementToBeDisplayed(Additionaldetails);
            Additionaldetails.click();
            wait.forElementToBeDisplayed(Customernotes);
            if (Customernotes.isDisplayed()) {
                wait.forElementToBeDisplayed(notedescription);
                String note = notedescription.getText();
                System.out.println(note);
                Assert.assertEquals("Bridgestone account 2", note);
                System.out.println("Customer Notes Verified");
            }
            

        }

}
Jenkins report
Building on master in workspace /var/jenkins_home/workspace/Reach24_Web_ProdSanity_Suite
The recommended git tool is: NONE
using credential ae3fab68-361e-4f25-99c8-1311b41c0abb
 > git rev-parse --is-inside-work-tree # timeout=10
Fetching changes from the remote Git repository
 > git config remote.origin.url https://github.com/reach24-net/Reach24AdminAutomation.git # timeout=10
Fetching upstream changes from https://github.com/reach24-net/Reach24AdminAutomation.git
 > git --version # timeout=10
 > git --version # 'git version 2.11.0'
using GIT_ASKPASS to set credentials 
 > git fetch --tags --progress -- https://github.com/reach24-net/Reach24AdminAutomation.git +refs/heads/*:refs/remotes/origin/* # timeout=10
 > git rev-parse refs/remotes/origin/master^{commit} # timeout=10
Checking out Revision f7134dd29d75f659b1a110e5f12c0318bb113d5d (refs/remotes/origin/master)
 > git config core.sparsecheckout # timeout=10
 > git checkout -f f7134dd29d75f659b1a110e5f12c0318bb113d5d # timeout=10
Commit message: "Update pom.xml"
 > git rev-list --no-walk 1389532eeff85bb748ed3fd3b5e9ad3722afad20 # timeout=10
Parsing POMs
Established TCP socket on 40587
[Reach24_Web_ProdSanity_Suite] $ /var/jenkins_home/tools/hudson.model.JDK/JAVA_HOME/bin/java -cp /var/jenkins_home/plugins/maven-plugin/WEB-INF/lib/maven35-agent-1.13.jar:/var/jenkins_home/tools/hudson.tasks.Maven_MavenInstallation/M2_HOME/boot/plexus-classworlds-2.6.0.jar:/var/jenkins_home/tools/hudson.tasks.Maven_MavenInstallation/M2_HOME/conf/logging jenkins.maven3.agent.Maven35Main /var/jenkins_home/tools/hudson.tasks.Maven_MavenInstallation/M2_HOME /var/jenkins_home/war/WEB-INF/lib/remoting-4.3.jar /var/jenkins_home/plugins/maven-plugin/WEB-INF/lib/maven35-interceptor-1.13.jar /var/jenkins_home/plugins/maven-plugin/WEB-INF/lib/maven3-interceptor-commons-1.13.jar 40587
<===[JENKINS REMOTING CAPACITY]===>channel started
Executing Maven:  -B -f /var/jenkins_home/workspace/Reach24_Web_ProdSanity_Suite/pom.xml clean install -DsuiteName=SanityRunner -Drp.uuid=8244c4e2-eba9-4e8d-9116-897c485da5d5 -Drp.endpoint=http://34.204.188.227:8080 -Drp.launch=Reach_WebSuite_ProdSanity -Drp.project=Reach_NightlyRun -Denvironment=prod
[INFO] Scanning for projects...
[INFO] 
[INFO] ----------------------< org.reach24:Reach24Admin >----------------------
[INFO] Building Reach24Admin 0.0.1-SNAPSHOT
[INFO] --------------------------------[ jar ]---------------------------------
[WARNING] The artifact org.apache.commons:commons-io:jar:1.3.2 has been relocated to commons-io:commons-io:jar:1.3.2
[INFO] 
[INFO] --- maven-clean-plugin:2.5:clean (default-clean) @ Reach24Admin ---
[INFO] Deleting /var/jenkins_home/workspace/Reach24_Web_ProdSanity_Suite/target
[INFO] 
[INFO] --- maven-resources-plugin:2.6:resources (default-resources) @ Reach24Admin ---
[INFO] Using 'UTF-8' encoding to copy filtered resources.
[INFO] skip non existing resourceDirectory /var/jenkins_home/workspace/Reach24_Web_ProdSanity_Suite/src/main/resources
[INFO] 
[INFO] --- maven-compiler-plugin:3.8.0:compile (default-compile) @ Reach24Admin ---
[INFO] Changes detected - recompiling the module!
[INFO] Compiling 28 source files to /var/jenkins_home/workspace/Reach24_Web_ProdSanity_Suite/target/classes
[INFO] -------------------------------------------------------------
[ERROR] COMPILATION ERROR : 
[INFO] -------------------------------------------------------------
[ERROR] /var/jenkins_home/workspace/Reach24_Web_ProdSanity_Suite/src/main/java/org/reach24/Reach24Admin/pages/EventCreationPage.java:[6,24] package org.junit does not exist
[ERROR] /var/jenkins_home/workspace/Reach24_Web_ProdSanity_Suite/src/main/java/org/reach24/Reach24Admin/pages/EventCreationPage.java:[6,1] static import only from classes and interfaces
[ERROR] /var/jenkins_home/workspace/Reach24_Web_ProdSanity_Suite/src/main/java/org/reach24/Reach24Admin/pages/CrosswalkPage.java:[3,17] package org.junit does not exist
[ERROR] /var/jenkins_home/workspace/Reach24_Web_ProdSanity_Suite/src/main/java/org/reach24/Reach24Admin/pages/CrosswalkPage.java:[65,33] cannot find symbol
  symbol:   variable Assert
  location: class org.reach24.Reach24Admin.pages.CrosswalkPage
[ERROR] /var/jenkins_home/workspace/Reach24_Web_ProdSanity_Suite/src/main/java/org/reach24/Reach24Admin/pages/CrosswalkPage.java:[74,25] cannot find symbol
  symbol:   variable Assert
  location: class org.reach24.Reach24Admin.pages.CrosswalkPage
[ERROR] /var/jenkins_home/workspace/Reach24_Web_ProdSanity_Suite/src/main/java/org/reach24/Reach24Admin/pages/CrosswalkPage.java:[76,25] cannot find symbol
  symbol:   variable Assert
  location: class org.reach24.Reach24Admin.pages.CrosswalkPage
[ERROR] /var/jenkins_home/workspace/Reach24_Web_ProdSanity_Suite/src/main/java/org/reach24/Reach24Admin/pages/CrosswalkPage.java:[78,25] cannot find symbol
  symbol:   variable Assert
  location: class org.reach24.Reach24Admin.pages.CrosswalkPage
[ERROR] /var/jenkins_home/workspace/Reach24_Web_ProdSanity_Suite/src/main/java/org/reach24/Reach24Admin/pages/CrosswalkPage.java:[82,25] cannot find symbol
  symbol:   variable Assert
  location: class org.reach24.Reach24Admin.pages.CrosswalkPage
[ERROR] /var/jenkins_home/workspace/Reach24_Web_ProdSanity_Suite/src/main/java/org/reach24/Reach24Admin/pages/CrosswalkPage.java:[90,33] cannot find symbol
  symbol:   variable Assert
  location: class org.reach24.Reach24Admin.pages.CrosswalkPage
[ERROR] /var/jenkins_home/workspace/Reach24_Web_ProdSanity_Suite/src/main/java/org/reach24/Reach24Admin/pages/CrosswalkPage.java:[99,25] cannot find symbol
  symbol:   variable Assert
  location: class org.reach24.Reach24Admin.pages.CrosswalkPage
[ERROR] /var/jenkins_home/workspace/Reach24_Web_ProdSanity_Suite/src/main/java/org/reach24/Reach24Admin/pages/CrosswalkPage.java:[101,25] cannot find symbol
  symbol:   variable Assert
  location: class org.reach24.Reach24Admin.pages.CrosswalkPage
[ERROR] /var/jenkins_home/workspace/Reach24_Web_ProdSanity_Suite/src/main/java/org/reach24/Reach24Admin/pages/CrosswalkPage.java:[103,25] cannot find symbol
  symbol:   variable Assert
  location: class org.reach24.Reach24Admin.pages.CrosswalkPage
[ERROR] /var/jenkins_home/workspace/Reach24_Web_ProdSanity_Suite/src/main/java/org/reach24/Reach24Admin/pages/CrosswalkPage.java:[107,25] cannot find symbol
  symbol:   variable Assert
  location: class org.reach24.Reach24Admin.pages.CrosswalkPage
[ERROR] /var/jenkins_home/workspace/Reach24_Web_ProdSanity_Suite/src/main/java/org/reach24/Reach24Admin/pages/CrosswalkPage.java:[110,25] cannot find symbol
  symbol:   variable Assert
  location: class org.reach24.Reach24Admin.pages.CrosswalkPage
[ERROR] /var/jenkins_home/workspace/Reach24_Web_ProdSanity_Suite/src/main/java/org/reach24/Reach24Admin/pages/CrosswalkPage.java:[120,25] cannot find symbol
  symbol:   variable Assert
  location: class org.reach24.Reach24Admin.pages.CrosswalkPage
[ERROR] /var/jenkins_home/workspace/Reach24_Web_ProdSanity_Suite/src/main/java/org/reach24/Reach24Admin/pages/CrosswalkPage.java:[123,25] cannot find symbol
  symbol:   variable Assert
  location: class org.reach24.Reach24Admin.pages.CrosswalkPage
[ERROR] /var/jenkins_home/workspace/Reach24_Web_ProdSanity_Suite/src/main/java/org/reach24/Reach24Admin/pages/CrosswalkPage.java:[126,25] cannot find symbol
  symbol:   variable Assert
  location: class org.reach24.Reach24Admin.pages.CrosswalkPage
[ERROR] /var/jenkins_home/workspace/Reach24_Web_ProdSanity_Suite/src/main/java/org/reach24/Reach24Admin/pages/CrosswalkPage.java:[131,33] cannot find symbol
  symbol:   variable Assert
  location: class org.reach24.Reach24Admin.pages.CrosswalkPage
[ERROR] /var/jenkins_home/workspace/Reach24_Web_ProdSanity_Suite/src/main/java/org/reach24/Reach24Admin/pages/CrosswalkPage.java:[140,25] cannot find symbol
  symbol:   variable Assert
  location: class org.reach24.Reach24Admin.pages.CrosswalkPage
[ERROR] /var/jenkins_home/workspace/Reach24_Web_ProdSanity_Suite/src/main/java/org/reach24/Reach24Admin/pages/CrosswalkPage.java:[142,25] cannot find symbol
  symbol:   variable Assert
  location: class org.reach24.Reach24Admin.pages.CrosswalkPage
[ERROR] /var/jenkins_home/workspace/Reach24_Web_ProdSanity_Suite/src/main/java/org/reach24/Reach24Admin/pages/CrosswalkPage.java:[144,25] cannot find symbol
  symbol:   variable Assert
  location: class org.reach24.Reach24Admin.pages.CrosswalkPage
[ERROR] /var/jenkins_home/workspace/Reach24_Web_ProdSanity_Suite/src/main/java/org/reach24/Reach24Admin/pages/CrosswalkPage.java:[148,25] cannot find symbol
  symbol:   variable Assert
  location: class org.reach24.Reach24Admin.pages.CrosswalkPage
[ERROR] /var/jenkins_home/workspace/Reach24_Web_ProdSanity_Suite/src/main/java/org/reach24/Reach24Admin/pages/CrosswalkPage.java:[151,25] cannot find symbol
  symbol:   variable Assert
  location: class org.reach24.Reach24Admin.pages.CrosswalkPage
[ERROR] /var/jenkins_home/workspace/Reach24_Web_ProdSanity_Suite/src/main/java/org/reach24/Reach24Admin/pages/CrosswalkPage.java:[158,25] cannot find symbol
  symbol:   variable Assert
  location: class org.reach24.Reach24Admin.pages.CrosswalkPage
[ERROR] /var/jenkins_home/workspace/Reach24_Web_ProdSanity_Suite/src/main/java/org/reach24/Reach24Admin/pages/CrosswalkPage.java:[161,25] cannot find symbol
  symbol:   variable Assert
  location: class org.reach24.Reach24Admin.pages.CrosswalkPage
[ERROR] /var/jenkins_home/workspace/Reach24_Web_ProdSanity_Suite/src/main/java/org/reach24/Reach24Admin/pages/CrosswalkPage.java:[179,33] cannot find symbol
  symbol:   variable Assert
  location: class org.reach24.Reach24Admin.pages.CrosswalkPage
[INFO] 26 errors 
[INFO] -------------------------------------------------------------
[INFO] ------------------------------------------------------------------------
[INFO] BUILD FAILURE
[INFO] ------------------------------------------------------------------------
[INFO] Total time:  5.533 s
[INFO] Finished at: 2021-10-14T12:12:37Z
[INFO] ------------------------------------------------------------------------
Waiting for Jenkins to finish collecting data
[ERROR] Failed to execute goal org.apache.maven.plugins:maven-compiler-plugin:3.8.0:compile (default-compile) on project Reach24Admin: Compilation failure: Compilation failure:
[ERROR] /var/jenkins_home/workspace/Reach24_Web_ProdSanity_Suite/src/main/java/org/reach24/Reach24Admin/pages/EventCreationPage.java:[6,24] package org.junit does not exist
[ERROR] /var/jenkins_home/workspace/Reach24_Web_ProdSanity_Suite/src/main/java/org/reach24/Reach24Admin/pages/EventCreationPage.java:[6,1] static import only from classes and interfaces
[ERROR] /var/jenkins_home/workspace/Reach24_Web_ProdSanity_Suite/src/main/java/org/reach24/Reach24Admin/pages/CrosswalkPage.java:[3,17] package org.junit does not exist
[ERROR] /var/jenkins_home/workspace/Reach24_Web_ProdSanity_Suite/src/main/java/org/reach24/Reach24Admin/pages/CrosswalkPage.java:[65,33] cannot find symbol
[ERROR] symbol:   variable Assert
[ERROR] location: class org.reach24.Reach24Admin.pages.CrosswalkPage
[ERROR] /var/jenkins_home/workspace/Reach24_Web_ProdSanity_Suite/src/main/java/org/reach24/Reach24Admin/pages/CrosswalkPage.java:[74,25] cannot find symbol
[ERROR] symbol:   variable Assert
[ERROR] location: class org.reach24.Reach24Admin.pages.CrosswalkPage
[ERROR] /var/jenkins_home/workspace/Reach24_Web_ProdSanity_Suite/src/main/java/org/reach24/Reach24Admin/pages/CrosswalkPage.java:[76,25] cannot find symbol
[ERROR] symbol:   variable Assert
[ERROR] location: class org.reach24.Reach24Admin.pages.CrosswalkPage
[ERROR] /var/jenkins_home/workspace/Reach24_Web_ProdSanity_Suite/src/main/java/org/reach24/Reach24Admin/pages/CrosswalkPage.java:[78,25] cannot find symbol
[ERROR] symbol:   variable Assert
[ERROR] location: class org.reach24.Reach24Admin.pages.CrosswalkPage
[ERROR] /var/jenkins_home/workspace/Reach24_Web_ProdSanity_Suite/src/main/java/org/reach24/Reach24Admin/pages/CrosswalkPage.java:[82,25] cannot find symbol
[ERROR] symbol:   variable Assert
[ERROR] location: class org.reach24.Reach24Admin.pages.CrosswalkPage
[ERROR] /var/jenkins_home/workspace/Reach24_Web_ProdSanity_Suite/src/main/java/org/reach24/Reach24Admin/pages/CrosswalkPage.java:[90,33] cannot find symbol
[ERROR] symbol:   variable Assert
[ERROR] location: class org.reach24.Reach24Admin.pages.CrosswalkPage
[ERROR] /var/jenkins_home/workspace/Reach24_Web_ProdSanity_Suite/src/main/java/org/reach24/Reach24Admin/pages/CrosswalkPage.java:[99,25] cannot find symbol
[ERROR] symbol:   variable Assert
[ERROR] location: class org.reach24.Reach24Admin.pages.CrosswalkPage
[ERROR] /var/jenkins_home/workspace/Reach24_Web_ProdSanity_Suite/src/main/java/org/reach24/Reach24Admin/pages/CrosswalkPage.java:[101,25] cannot find symbol
[ERROR] symbol:   variable Assert
[ERROR] location: class org.reach24.Reach24Admin.pages.CrosswalkPage
[ERROR] /var/jenkins_home/workspace/Reach24_Web_ProdSanity_Suite/src/main/java/org/reach24/Reach24Admin/pages/CrosswalkPage.java:[103,25] cannot find symbol
[JENKINS] Archiving /var/jenkins_home/workspace/Reach24_Web_ProdSanity_Suite/pom.xml to org.reach24/Reach24Admin/0.0.1-SNAPSHOT/Reach24Admin-0.0.1-SNAPSHOT.pom
[ERROR] symbol:   variable Assert
[ERROR] location: class org.reach24.Reach24Admin.pages.CrosswalkPage
[ERROR] /var/jenkins_home/workspace/Reach24_Web_ProdSanity_Suite/src/main/java/org/reach24/Reach24Admin/pages/CrosswalkPage.java:[107,25] cannot find symbol
[ERROR] symbol:   variable Assert
[ERROR] location: class org.reach24.Reach24Admin.pages.CrosswalkPage
[ERROR] /var/jenkins_home/workspace/Reach24_Web_ProdSanity_Suite/src/main/java/org/reach24/Reach24Admin/pages/CrosswalkPage.java:[110,25] cannot find symbol
[ERROR] symbol:   variable Assert
[ERROR] location: class org.reach24.Reach24Admin.pages.CrosswalkPage
[ERROR] /var/jenkins_home/workspace/Reach24_Web_ProdSanity_Suite/src/main/java/org/reach24/Reach24Admin/pages/CrosswalkPage.java:[120,25] cannot find symbol
[ERROR] symbol:   variable Assert
[ERROR] location: class org.reach24.Reach24Admin.pages.CrosswalkPage
[ERROR] /var/jenkins_home/workspace/Reach24_Web_ProdSanity_Suite/src/main/java/org/reach24/Reach24Admin/pages/CrosswalkPage.java:[123,25] cannot find symbol
[ERROR] symbol:   variable Assert
[ERROR] location: class org.reach24.Reach24Admin.pages.CrosswalkPage
[ERROR] /var/jenkins_home/workspace/Reach24_Web_ProdSanity_Suite/src/main/java/org/reach24/Reach24Admin/pages/CrosswalkPage.java:[126,25] cannot find symbol
[ERROR] symbol:   variable Assert
[ERROR] location: class org.reach24.Reach24Admin.pages.CrosswalkPage
[ERROR] /var/jenkins_home/workspace/Reach24_Web_ProdSanity_Suite/src/main/java/org/reach24/Reach24Admin/pages/CrosswalkPage.java:[131,33] cannot find symbol
[ERROR] symbol:   variable Assert
[ERROR] location: class org.reach24.Reach24Admin.pages.CrosswalkPage
[ERROR] /var/jenkins_home/workspace/Reach24_Web_ProdSanity_Suite/src/main/java/org/reach24/Reach24Admin/pages/CrosswalkPage.java:[140,25] cannot find symbol
[ERROR] symbol:   variable Assert
[ERROR] location: class org.reach24.Reach24Admin.pages.CrosswalkPage
[ERROR] /var/jenkins_home/workspace/Reach24_Web_ProdSanity_Suite/src/main/java/org/reach24/Reach24Admin/pages/CrosswalkPage.java:[142,25] cannot find symbol
[ERROR] symbol:   variable Assert
[ERROR] location: class org.reach24.Reach24Admin.pages.CrosswalkPage
[ERROR] /var/jenkins_home/workspace/Reach24_Web_ProdSanity_Suite/src/main/java/org/reach24/Reach24Admin/pages/CrosswalkPage.java:[144,25] cannot find symbol
[ERROR] symbol:   variable Assert
[ERROR] location: class org.reach24.Reach24Admin.pages.CrosswalkPage
[ERROR] /var/jenkins_home/workspace/Reach24_Web_ProdSanity_Suite/src/main/java/org/reach24/Reach24Admin/pages/CrosswalkPage.java:[148,25] cannot find symbol
[ERROR] symbol:   variable Assert
[ERROR] location: class org.reach24.Reach24Admin.pages.CrosswalkPage
[ERROR] /var/jenkins_home/workspace/Reach24_Web_ProdSanity_Suite/src/main/java/org/reach24/Reach24Admin/pages/CrosswalkPage.java:[151,25] cannot find symbol
[ERROR] symbol:   variable Assert
[ERROR] location: class org.reach24.Reach24Admin.pages.CrosswalkPage
[ERROR] /var/jenkins_home/workspace/Reach24_Web_ProdSanity_Suite/src/main/java/org/reach24/Reach24Admin/pages/CrosswalkPage.java:[158,25] cannot find symbol
[ERROR] symbol:   variable Assert
[ERROR] location: class org.reach24.Reach24Admin.pages.CrosswalkPage
[ERROR] /var/jenkins_home/workspace/Reach24_Web_ProdSanity_Suite/src/main/java/org/reach24/Reach24Admin/pages/CrosswalkPage.java:[161,25] cannot find symbol
[ERROR] symbol:   variable Assert
[ERROR] location: class org.reach24.Reach24Admin.pages.CrosswalkPage
[ERROR] /var/jenkins_home/workspace/Reach24_Web_ProdSanity_Suite/src/main/java/org/reach24/Reach24Admin/pages/CrosswalkPage.java:[179,33] cannot find symbol
[ERROR] symbol:   variable Assert
[ERROR] location: class org.reach24.Reach24Admin.pages.CrosswalkPage
[ERROR] -> [Help 1]
[ERROR] 
[ERROR] To see the full stack trace of the errors, re-run Maven with the -e switch.
[ERROR] Re-run Maven using the -X switch to enable full debug logging.
[ERROR] 
[ERROR] For more information about the errors and possible solutions, please read the following articles:
[ERROR] [Help 1] http://cwiki.apache.org/confluence/display/MAVEN/MojoFailureException
channel stopped
[Slack Notifications] found #402 as previous completed, non-aborted build
[Slack Notifications] will send OnEveryFailureNotification because build matches and user preferences allow it
Finished: FAILURE

> Blockquote